Reaction Details
TargetHistone deacetylase
LigandBDBM50166167
Substrate/Competitorn/a
Meas. Tech.ChEMBL_532345 (CHEMBL973268)
IC50 570±n/a nM
Citation Ragno, RSimeoni, SRotili, DCaroli, ABotta, GBrosch, GMassa, SMai, A Class II-selective histone deacetylase inhibitors. Part 2: alignment-independent GRIND 3-D QSAR, homology and docking studies. Eur J Med Chem43:621-32 (2008) 
 
Histone deacetylase
Name:Histone deacetylase
Synonyms:Histone deacetylase HD1B
Type:PROTEIN
Mol. Mass.:50930.01
Organism:Zea mays
Description:ChEMBL_422128
Residue:458
BDBM50166167
NameBDBM50166167
TypeSmall organic molecule
Emp. Form.C18H18N2O3
Mol. Mass.310.3471
SMILESC\C(=C/c1cc(\C=C\C(=O)NO)n(C)c1)C(=O)c1ccccc1