Reaction Details
TargetHistone deacetylase
LigandBDBM50134802
Substrate/Competitorn/a
Meas. Tech.ChEMBL_532345 (CHEMBL973268)
IC50 1600±n/a nM
Citation Ragno, RSimeoni, SRotili, DCaroli, ABotta, GBrosch, GMassa, SMai, A Class II-selective histone deacetylase inhibitors. Part 2: alignment-independent GRIND 3-D QSAR, homology and docking studies. Eur J Med Chem43:621-32 (2008) 
 
Histone deacetylase
Name:Histone deacetylase
Synonyms:Histone deacetylase HD1B
Type:PROTEIN
Mol. Mass.:50930.01
Organism:Zea mays
Description:ChEMBL_422128
Residue:458
BDBM50134802
NameBDBM50134802
TypeSmall organic molecule
Emp. Form.C17H15ClN2O3
Mol. Mass.330.766
SMILESCn1cc(\C=C\C(=O)c2ccccc2Cl)cc1\C=C\C(=O)NO