Reaction Details
TargetSqualene synthase
LigandBDBM50208577
Substrate/Competitorn/a
Meas. Tech.ChEMBL_520603 (CHEMBL959525)
IC50 33±n/a nM
Citation Cammerer, SBJimenez, CJones, SGros, LLorente, SORodrigues, CRodrigues, JCCaldera, ARuiz Perez, LMda Souza, WKaiser, MBrun, RUrbina, JAGonzalez Pacanowska, DGilbert, IH Quinuclidine derivatives as potential antiparasitics. Antimicrob Agents Chemother51:4049-61 (2007) 
 
Squalene synthase
Name:Squalene synthase
Synonyms:Farnesyltransferase, putative
Type:PROTEIN
Mol. Mass.:47117.40
Organism:Leishmania major
Description:ChEMBL_520603
Residue:414
BDBM50208577
NameBDBM50208577
TypeSmall organic molecule
Emp. Form.C25H30N2O3
Mol. Mass.406.5173
SMILESCOCCCOc1ccc(C#C[C@@]2(O)CN3CCC2CC3)c(Cc2ccccc2)n1