Reaction Details
TargetSqualene synthase
LigandBDBM50269918
Substrate/Competitorn/a
Meas. Tech.ChEMBL_520603 (CHEMBL959525)
IC50>1000±n/a nM
Citation Cammerer, SBJimenez, CJones, SGros, LLorente, SORodrigues, CRodrigues, JCCaldera, ARuiz Perez, LMda Souza, WKaiser, MBrun, RUrbina, JAGonzalez Pacanowska, DGilbert, IH Quinuclidine derivatives as potential antiparasitics. Antimicrob Agents Chemother51:4049-61 (2007) 
 
Squalene synthase
Name:Squalene synthase
Synonyms:Farnesyltransferase, putative
Type:PROTEIN
Mol. Mass.:47117.40
Organism:Leishmania major
Description:ChEMBL_520603
Residue:414
BDBM50269918
NameBDBM50269918
TypeSmall organic molecule
Emp. Form.C15H17NO2S
Mol. Mass.275.366
SMILESCC(=O)c1ccc(s1)C#CC1(O)CN2CCC1CC2