Reaction Details
TargetBeta-lactamase TEM
LigandBDBM50021959
Substrate/Competitorn/a
Meas. Tech.ChEMBL_520659 (CHEMBL965223)
IC50 80±n/a nM
Citation Robin, FDelmas, JBrebion, ADubois, DConstantin, JMBonnet, R TEM-158 (CMT-9), a new member of the CMT-type extended-spectrum beta-lactamases. Antimicrob Agents Chemother51:4181-3 (2007) 
 
Beta-lactamase TEM
Name:Beta-lactamase TEM
Type:Enzyme
Mol. Mass.:31512.33
Organism:Escherichia coli
Description:P62593
Residue:286
BDBM50021959
NameBDBM50021959
Synonyms:CHEMBL777 US9120808, Clavulanic acid potassium salt clavulanic acid
TypeSmall organic molecule
Emp. Form.C8H9NO5
Mol. Mass.199.1608
SMILESOC\C=C1/O[C@@H]2CC(=O)N2[C@H]1C(O)=O