Reaction Details
TargetBeta-lactamase
LigandBDBM50053173
Substrate/Competitorn/a
Meas. Tech.ChEMBL_520656 (CHEMBL962725)
IC50 240±n/a nM
Citation Robin, FDelmas, JBrebion, ADubois, DConstantin, JMBonnet, R TEM-158 (CMT-9), a new member of the CMT-type extended-spectrum beta-lactamases. Antimicrob Agents Chemother51:4181-3 (2007) 
 
Beta-lactamase
Name:Beta-lactamase
Synonyms:Beta-lactamase TEM-125
Type:PROTEIN
Mol. Mass.:31361.12
Organism:Escherichia coli
Description:ChEMBL_520656
Residue:286
BDBM50053173
NameBDBM50053173
TypeSmall organic molecule
Emp. Form.C10H12N4O5S
Mol. Mass.300.291
SMILESC[C@]1(Cn2ccnn2)[C@@H](N2[C@@H](CC2=O)S1(=O)=O)C(O)=O