Reaction Details
TargetProstaglandin G/H synthase 2
LigandBDBM50272131
Substrate/Competitorn/a
Meas. Tech.ChEMBL_510899 (CHEMBL997791)
IC50 0.02±n/a nM
Citation Gupta, AKGupta, RASoni, LKKaskhedikar, SG Exploration of physicochemical properties and molecular modelling studies of 2-sulfonyl-phenyl-3-phenyl-indole analogs as cyclooxygenase-2 inhibitors. Eur J Med Chem43:1297-303 (2008) 
 
Prostaglandin G/H synthase 2
Name:Prostaglandin G/H synthase 2
Type:Enzyme
Mol. Mass.:69003.89
Organism:Homo sapiens (Human)
Description:Recombinant Cox-2 provided by Cayman (Cayman Chemical Co.,Ann Arbor, MI).
Residue:604
BDBM50272131
NameBDBM50272131
Synonyms:3-(4-fluorophenyl)-2-(4-(methylsulfonyl)phenyl)-1H-indole | CHEMBL501208
TypeSmall organic molecule
Emp. Form.C21H16FNO2S
Mol. Mass.365.421
SMILESCS(=O)(=O)c1ccc(cc1)-c1[nH]c2ccccc2c1-c1ccc(F)cc1