Reaction Details
TargetProstaglandin G/H synthase 2
LigandBDBM50272125
Substrate/Competitorn/a
Meas. Tech.ChEMBL_510899 (CHEMBL997791)
IC50 0.07±n/a nM
Citation Gupta, AKGupta, RASoni, LKKaskhedikar, SG Exploration of physicochemical properties and molecular modelling studies of 2-sulfonyl-phenyl-3-phenyl-indole analogs as cyclooxygenase-2 inhibitors. Eur J Med Chem43:1297-303 (2008) 
 
Prostaglandin G/H synthase 2
Name:Prostaglandin G/H synthase 2
Type:Enzyme
Mol. Mass.:69003.89
Organism:Homo sapiens (Human)
Description:Recombinant Cox-2 provided by Cayman (Cayman Chemical Co.,Ann Arbor, MI).
Residue:604
BDBM50272125
NameBDBM50272125
Synonyms:4-(3-p-tolyl-1H-indol-2-yl)benzenesulfonamide | CHEMBL502555
TypeSmall organic molecule
Emp. Form.C21H18N2O2S
Mol. Mass.362.445
SMILESCc1ccc(cc1)-c1c([nH]c2ccccc12)-c1ccc(cc1)S(N)(=O)=O