Reaction Details
TargetMitogen-activated protein kinase kinase kinase 8
LigandBDBM21898
Substrate/Competitorn/a
Meas. Tech.ChEMBL_529509 (CHEMBL966653)
IC50 12±n/a nM
Citation Hall, JPKurdi, YHsu, SCuozzo, JLiu, JTelliez, JBSeidl, KJWinkler, AHu, YGreen, NAskew, GRTam, SClark, JDLin, LL Pharmacologic inhibition of tpl2 blocks inflammatory responses in primary human monocytes, synoviocytes, and blood. J Biol Chem282:33295-304 (2007) 
 
Mitogen-activated protein kinase kinase kinase 8
Name:Mitogen-activated protein kinase kinase kinase 8
Type:Serine/threonine-protein kinase
Mol. Mass.:52916.89
Organism:Homo sapiens (Human)
Description:P41279
Residue:467
BDBM21898
NameBDBM21898
Synonyms:8-chloro-4-[(3-chloro-4-fluorophenyl)amino]-6-[(1H-imidazol-4-ylmethyl)amino]quinoline-3-carbonitrile Cyanoquinoline, 11
TypeSmall organic molecule
Emp. Form.C20H13Cl2FN6
Mol. Mass.427.262
SMILESFc1ccc(Nc2c(cnc3c(Cl)cc(NCc4cnc[nH]4)cc23)C#N)cc1Cl