Reaction Details
TargetMitogen-activated protein kinase 14
LigandBDBM21898
Substrate/Competitorn/a
Meas. Tech.ChEMBL_529511 (CHEMBL966655)
IC50>100000±n/a nM
Citation Hall, JPKurdi, YHsu, SCuozzo, JLiu, JTelliez, JBSeidl, KJWinkler, AHu, YGreen, NAskew, GRTam, SClark, JDLin, LL Pharmacologic inhibition of tpl2 blocks inflammatory responses in primary human monocytes, synoviocytes, and blood. J Biol Chem282:33295-304 (2007) 
 
Mitogen-activated protein kinase 14
Name:Mitogen-activated protein kinase 14
Type:Serine/threonine-protein kinase
Mol. Mass.:41286.76
Organism:Homo sapiens (Human)
Description:Q16539
Residue:360
BDBM21898
NameBDBM21898
Synonyms:8-chloro-4-[(3-chloro-4-fluorophenyl)amino]-6-[(1H-imidazol-4-ylmethyl)amino]quinoline-3-carbonitrile Cyanoquinoline, 11
TypeSmall organic molecule
Emp. Form.C20H13Cl2FN6
Mol. Mass.427.262
SMILESFc1ccc(Nc2c(cnc3c(Cl)cc(NCc4cnc[nH]4)cc23)C#N)cc1Cl