Reaction Details
TargetWee1-like protein kinase
LigandBDBM50192371
Substrate/Competitorn/a
Meas. Tech.ChEMBL_511068 (CHEMBL1000360)
IC50 11±n/a nM
Citation Smaill, JBBaker, ENBooth, RJBridges, AJDickson, JMDobrusin, EMIvanovic, IKraker, AJLee, HHLunney, EAOrtwine, DFPalmer, BDQuin, JSquire, CJThompson, AMDenny, WA Synthesis and structure-activity relationships of N-6 substituted analogues of 9-hydroxy-4-phenylpyrrolo[3,4-c]carbazole-1,3(2H,6H)-diones as inhibitors of Wee1 and Chk1 checkpoint kinases. Eur J Med Chem43:1276-96 (2008) 
 
Wee1-like protein kinase
Name:Wee1-like protein kinase
Type:PROTEIN
Mol. Mass.:71599.12
Organism:Homo sapiens (Human)
Description:ChEMBL_1445054
Residue:646
BDBM50192371
NameBDBM50192371
Synonyms:4-(2-chlorophenyl)-9-hydroxypyrrolo[3,4-c]carbazole-1,3(2H,6H)-dione | CHEMBL379975
TypeSmall organic molecule
Emp. Form.C20H11ClN2O3
Mol. Mass.362.766
SMILESOc1ccc2[nH]c3cc(c4C(=O)NC(=O)c4c3c2c1)-c1ccccc1Cl