Reaction Details
TargetCyclin-dependent kinase 1
LigandBDBM50245459
Substrate/Competitorn/a
Meas. Tech.ChEMBL_511073 (CHEMBL1000365)
IC50>3400±n/a nM
Citation Smaill, JBBaker, ENBooth, RJBridges, AJDickson, JMDobrusin, EMIvanovic, IKraker, AJLee, HHLunney, EAOrtwine, DFPalmer, BDQuin, JSquire, CJThompson, AMDenny, WA Synthesis and structure-activity relationships of N-6 substituted analogues of 9-hydroxy-4-phenylpyrrolo[3,4-c]carbazole-1,3(2H,6H)-diones as inhibitors of Wee1 and Chk1 checkpoint kinases. Eur J Med Chem43:1276-96 (2008) 
 
Cyclin-dependent kinase 1
Name:Cyclin-dependent kinase 1
Type:Enzyme Subunit
Mol. Mass.:34101.08
Organism:Homo sapiens (Human)
Description:P06493
Residue:297
BDBM50245459
NameBDBM50245459
Synonyms:4-(2-Chlorophenyl)-9-hydroxy-6-[3-(1H-tetrazol-5-yl)-propyl]pyrrolo[3,4-c]carbazole-1,3(2H,6H )-dione CHEMBL471329
TypeSmall organic molecule
Emp. Form.C24H17ClN6O3
Mol. Mass.472.883
SMILESOc1ccc2n(CCCc3nnn[nH]3)c3cc(c4C(=O)NC(=O)c4c3c2c1)-c1ccccc1Cl