Reaction Details
TargetProto-oncogene tyrosine-protein kinase Src
LigandBDBM50245734
Substrate/Competitorn/a
Meas. Tech.ChEMBL_511308 (CHEMBL996963)
IC50 46000±n/a nM
Citation Smaill, JBBaker, ENBooth, RJBridges, AJDickson, JMDobrusin, EMIvanovic, IKraker, AJLee, HHLunney, EAOrtwine, DFPalmer, BDQuin, JSquire, CJThompson, AMDenny, WA Synthesis and structure-activity relationships of N-6 substituted analogues of 9-hydroxy-4-phenylpyrrolo[3,4-c]carbazole-1,3(2H,6H)-diones as inhibitors of Wee1 and Chk1 checkpoint kinases. Eur J Med Chem43:1276-96 (2008) 
 
Proto-oncogene tyrosine-protein kinase Src
Name:Proto-oncogene tyrosine-protein kinase Src
Type:Protein
Mol. Mass.:59838.60
Organism:Homo sapiens (Human)
Description:P12931
Residue:536
BDBM50245734
NameBDBM50245734
Synonyms:9-hydroxy-6-(3-morpholinopropyl)-4-phenylpyrrolo[3,4-c]carbazole-1,3(2H,6H)-dione | CHEMBL510668
TypeSmall organic molecule
Emp. Form.C27H25N3O4
Mol. Mass.455.5051
SMILESOc1ccc2n(CCCN3CCOCC3)c3cc(c4C(=O)NC(=O)c4c3c2c1)-c1ccccc1