Reaction Details
TargetWee1-like protein kinase
LigandBDBM50245497
Substrate/Competitorn/a
Meas. Tech.ChEMBL_511068 (CHEMBL1000360)
IC50 30±n/a nM
Citation Smaill, JBBaker, ENBooth, RJBridges, AJDickson, JMDobrusin, EMIvanovic, IKraker, AJLee, HHLunney, EAOrtwine, DFPalmer, BDQuin, JSquire, CJThompson, AMDenny, WA Synthesis and structure-activity relationships of N-6 substituted analogues of 9-hydroxy-4-phenylpyrrolo[3,4-c]carbazole-1,3(2H,6H)-diones as inhibitors of Wee1 and Chk1 checkpoint kinases. Eur J Med Chem43:1276-96 (2008) 
 
Wee1-like protein kinase
Name:Wee1-like protein kinase
Type:PROTEIN
Mol. Mass.:71599.12
Organism:Homo sapiens (Human)
Description:ChEMBL_1445054
Residue:646
BDBM50245497
NameBDBM50245497
Synonyms:9-Hydroxy-6-(3-hydroxypropyl)-4-(2-methoxyphenyl)-pyrrolo[3,4-c]carbazole-1,3(2H,6H)-dione | 9-hydroxy-6-(3-hydroxypropyl)-4-(2-methoxyphenyl)pyrrolo[3,4-c]carbazole-1,3(2H,6H)-dione
TypeSmall organic molecule
Emp. Form.C24H20N2O5
Mol. Mass.416.426
SMILESCOc1ccccc1-c1cc2n(CCCO)c3ccc(O)cc3c2c2C(=O)NC(=O)c12