Reaction Details
TargetBeta-lactamase
LigandBDBM50021954
Substrate/Competitorn/a
Meas. Tech.ChEMBL_522056 (CHEMBL1004914)
IC50 22700±n/a nM
Citation Fonseca, FSarmento, ACHenriques, ISamyn, Bvan Beeumen, JDomingues, PDomingues, MRSaavedra, MJCorreia, A Biochemical Characterization of SFC-1, a class A carbapenem-hydrolyzing beta-lactamase. Antimicrob Agents Chemother51:4512-4 (2007) 
 
Beta-lactamase
Name:Beta-lactamase
Synonyms:Carbapenem-hydrolizing beta-lactamase SFC-1
Type:PROTEIN
Mol. Mass.:33593.82
Organism:Serratia fonticola
Description:ChEMBL_522056
Residue:309
BDBM50021954
NameBDBM50021954
TypeSmall organic molecule
Emp. Form.C8H11NO5S
Mol. Mass.233.242
SMILESCC1(C)[C@@H](N2[C@@H](CC2=O)S1(=O)=O)C(O)=O