Reaction Details
TargetThyroid hormone receptor beta
LigandBDBM18860
Substrate/Competitorn/a
Meas. Tech.ChEMBL_533637 (CHEMBL969513)
Ki 0.55±n/a nM
Citation Erion, MDCable, EEIto, BRJiang, HFujitaki, JMFinn, PDZhang, BHHou, JBoyer, SHvan Poelje, PDLinemeyer, DL Targeting thyroid hormone receptor-beta agonists to the liver reduces cholesterol and triglycerides and improves the therapeutic index. Proc Natl Acad Sci U S A104:15490-5 (2007) 
 
Thyroid hormone receptor beta
Name:Thyroid hormone receptor beta
Type:Receptor
Mol. Mass.:52793.62
Organism:Homo sapiens (Human)
Description:Recombinant hThR was obtained from nuclear extracts from SF9 cells infected with baculovirus vectors encoding for ThRbeta 1.
Residue:461
BDBM18860
NameBDBM18860
Synonyms:(2R)-2-amino-3-[4-(4-hydroxy-3-iodophenoxy)-3,5-diiodophenyl]propanoic acid 3,5,3'-triiodo-L-thyronine (T3) Triiodothyronine US10544075, Compound T3 liothyronine | triothyrone
TypeHormone
Emp. Form.C15H12I3NO4
Mol. Mass.650.9735
SMILESN[C@@H](Cc1cc(I)c(Oc2ccc(O)c(I)c2)c(I)c1)C(O)=O