Reaction Details
TargetTyrosine-protein kinase Lck
LigandBDBM50099692
Substrate/Competitorn/a
Meas. Tech.ChEMBL_529613 (CHEMBL968351)
IC50 3800±n/a nM
Citation Chen, IJChen, HLDemetriou, M Lateral compartmentalization of T cell receptor versus CD45 by galectin-N-glycan binding and microfilaments coordinate basal and activation signaling. J Biol Chem282:35361-72 (2007) 
 
Tyrosine-protein kinase Lck
Name:Tyrosine-protein kinase Lck
Type:n/a
Mol. Mass.:57987.83
Organism:Homo sapiens (Human)
Description:P06239
Residue:509
BDBM50099692
NameBDBM50099692
Synonyms:CHEMBL51314 N-(9,10-Dioxo-9,10-dihydro-phenanthrene-2-yl)-2,2-dimethyl-propionamide | N-(9,10-dioxo-9,10-dihydrophenanthren-2-yl)-2,2-dimethylpropionamide
TypeSmall organic molecule
Emp. Form.C19H17NO3
Mol. Mass.307.3432
SMILESCC(C)(C)C(=O)Nc1ccc-2c(c1)C(=O)C(=O)c1ccccc-21