Reaction Details
TargetTyrosine-protein phosphatase non-receptor type 13
LigandBDBM50099692
Substrate/Competitorn/a
Meas. Tech.ChEMBL_529615 (CHEMBL968353)
IC50>30000±n/a nM
Citation Chen, IJChen, HLDemetriou, M Lateral compartmentalization of T cell receptor versus CD45 by galectin-N-glycan binding and microfilaments coordinate basal and activation signaling. J Biol Chem282:35361-72 (2007) 
 
Tyrosine-protein phosphatase non-receptor type 13
Name:Tyrosine-protein phosphatase non-receptor type 13
Type:Protein
Mol. Mass.:276896.33
Organism:Homo sapiens (Human)
Description:Q12923
Residue:2485
BDBM50099692
NameBDBM50099692
Synonyms:CHEMBL51314 N-(9,10-Dioxo-9,10-dihydro-phenanthrene-2-yl)-2,2-dimethyl-propionamide | N-(9,10-dioxo-9,10-dihydrophenanthren-2-yl)-2,2-dimethylpropionamide
TypeSmall organic molecule
Emp. Form.C19H17NO3
Mol. Mass.307.3432
SMILESCC(C)(C)C(=O)Nc1ccc-2c(c1)C(=O)C(=O)c1ccccc-21