Reaction Details
TargetProthrombin
LigandBDBM50241050
Substrate/Competitorn/a
Meas. Tech.ChEMBL_511555 (CHEMBL966265)
Kd 6900000±n/a nM
Citation Friedrich, RRiester, DGöttig, PThürk, MSchwienhorst, ABode, W Structure of a novel thrombin inhibitor with an uncharged D-amino acid as P1 residue. Eur J Med Chem43:1330-5 (2008) 
 
Prothrombin
Name:Prothrombin
Type:Protein
Mol. Mass.:70029.57
Organism:Homo sapiens (Human)
Description:P00734
Residue:622
BDBM50241050
NameBDBM50241050
Synonyms:2-(6-fluoro-1H-indol-3-yl)ethanamine CHEMBL381160
TypeSmall organic molecule
Emp. Form.C10H11FN2
Mol. Mass.178.2061
SMILESNCCc1c[nH]c2cc(F)ccc12