Reaction Details
TargetHepatocyte growth factor receptor
LigandBDBM50245431
Substrate/Competitorn/a
Meas. Tech.ChEMBL_511827 (CHEMBL969890)
Ki 50±n/a nM
Citation Kung, PPFunk, LMeng, JAlton, GPadrique, EMroczkowski, B Structure activity relationships of quinoline-containing c-Met inhibitors. Eur J Med Chem43:1321-9 (2008) 
 
Hepatocyte growth factor receptor
Name:Hepatocyte growth factor receptor
Type:Protein
Mol. Mass.:155559.73
Organism:Homo sapiens (Human)
Description:P08581
Residue:1390
BDBM50245431
NameBDBM50245431
Synonyms:CHEMBL472552 | N-[({5-[(6,7-Dimethoxyquinolin-4-yl)-oxy]pyridin-2-yl}amino)carbonyl]benzamide
TypeSmall organic molecule
Emp. Form.C24H20N4O5
Mol. Mass.444.4394
SMILESCOc1cc2nccc(Oc3ccc(NC(=O)NC(=O)c4ccccc4)nc3)c2cc1OC