Reaction Details
TargetCyclin-dependent kinase 5
LigandBDBM50186073
Substrate/Competitorn/a
Meas. Tech.ChEMBL_519478 (CHEMBL951784)
IC50 4000±n/a nM
Citation Logé, CTestard, AThiéry, VLozach, OBlairvacq, MRobert, JMMeijer, LBesson, T Novel 9-oxo-thiazolo[5,4-f]quinazoline-2-carbonitrile derivatives as dual cyclin-dependent kinase 1 (CDK1)/glycogen synthase kinase-3 (GSK-3) inhibitors: synthesis, biological evaluation and molecular modeling studies. Eur J Med Chem43:1469-77 (2008) 
 
Cyclin-dependent kinase 5
Name:Cyclin-dependent kinase 5
Type:Enzyme Subunit
Mol. Mass.:33308.61
Organism:Homo sapiens (Human)
Description:n/a
Residue:292
BDBM50186073
NameBDBM50186073
Synonyms:CHEMBL210229 N-(2-Dimethylamino-ethyl)-8-isopopyl-9-oxo-8,9-dihydro[1,3]thiazolo[5,4-f]quinazoline-2-carboxamidine
TypeSmall organic molecule
Emp. Form.C17H22N6OS
Mol. Mass.358.461
SMILESCC(C)n1cnc2ccc3nc(sc3c2c1=O)C(=N)NCCN(C)C