Reaction Details
TargetGlycogen synthase kinase-3 alpha
LigandBDBM50247394
Substrate/Competitorn/a
Meas. Tech.ChEMBL_519479 (CHEMBL951785)
IC50 300±n/a nM
Citation Logé, CTestard, AThiéry, VLozach, OBlairvacq, MRobert, JMMeijer, LBesson, T Novel 9-oxo-thiazolo[5,4-f]quinazoline-2-carbonitrile derivatives as dual cyclin-dependent kinase 1 (CDK1)/glycogen synthase kinase-3 (GSK-3) inhibitors: synthesis, biological evaluation and molecular modeling studies. Eur J Med Chem43:1469-77 (2008) 
 
Glycogen synthase kinase-3 alpha
Name:Glycogen synthase kinase-3 alpha
Type:Enzyme
Mol. Mass.:50991.79
Organism:Homo sapiens (Human)
Description:P49840
Residue:483
BDBM50247394
NameBDBM50247394
Synonyms:8-Ethyl-9-oxo-8,9-dihydro-thiazolo[5,4-f]quinazoline-2-carboximidic acid phenyl ethyl ester | CHEMBL453133
TypeSmall organic molecule
Emp. Form.C20H18N4O2S
Mol. Mass.378.448
SMILESCCn1cnc2ccc3nc(sc3c2c1=O)C(=N)OCCc1ccccc1