Reaction Details
TargetMu-type opioid receptor
LigandBDBM50265405
Substrate/Competitorn/a
Meas. Tech.ChEMBL_497291 (CHEMBL995853)
Ki>10000±n/a nM
Citation Mercer, SLShaikh, JTraynor, JRMatsumoto, RRCoop, A Nitrile analogs of meperidine as high affinity and selective sigma-1 receptor ligands. Eur J Med Chem43:1304-8 (2008) 
 
Mu-type opioid receptor
Name:Mu-type opioid receptor
Type:G Protein-Coupled Receptor (GPCR)
Mol. Mass.:44789.51
Organism:Homo sapiens (Human)
Description:P35372
Residue:400
BDBM50265405
NameBDBM50265405
Synonyms:1-Methyl-4-phenylpiperidine-4-carbonitrile | CHEMBL495954
TypeSmall organic molecule
Emp. Form.C13H16N2
Mol. Mass.200.2795
SMILESCN1CCC(CC1)(C#N)c1ccccc1