Reaction Details
TargetSigma non-opioid intracellular receptor 1
LigandBDBM50265434
Substrate/Competitorn/a
Meas. Tech.ChEMBL_497294 (CHEMBL995856)
Ki 0.410000±n/a nM
Citation Mercer, SLShaikh, JTraynor, JRMatsumoto, RRCoop, A Nitrile analogs of meperidine as high affinity and selective sigma-1 receptor ligands. Eur J Med Chem43:1304-8 (2008) 
 
Sigma non-opioid intracellular receptor 1
Name:Sigma non-opioid intracellular receptor 1
Type:Enzyme Catalytic Domain
Mol. Mass.:25266.54
Organism:RAT
Description:Q9R0C9
Residue:223
BDBM50265434
NameBDBM50265434
Synonyms:1-Benzyl-4-phenylpiperidine-4-carbonitrile | CHEMBL495549
TypeSmall organic molecule
Emp. Form.C19H20N2
Mol. Mass.276.3755
SMILESN#CC1(CCN(Cc2ccccc2)CC1)c1ccccc1