Reaction Details
TargetCyclin-dependent kinase 2
LigandBDBM7101
Substrate/Competitorn/a
Meas. Tech.ChEMBL_519498 (CHEMBL951804)
IC50 37±n/a nM
Citation Mascarenhas, NMGhoshal, N An efficient tool for identifying inhibitors based on 3D-QSAR and docking using feature-shape pharmacophore of biologically active conformation--a case study with CDK2/cyclinA. Eur J Med Chem43:2807-18 (2008) 
 
Cyclin-dependent kinase 2
Name:Cyclin-dependent kinase 2
Type:Enzyme Subunit
Mol. Mass.:33938.17
Organism:Homo sapiens (Human)
Description:P24941
Residue:298
BDBM7101
NameBDBM7101
Synonyms:(2S)-N-(5-Cyclopropyl-1H-pyrazol-3-yl)-2-[4-(2-oxopyrrolidin-1-yl)phenyl]propanamide CHEMBL191144 | PHA-533533
TypeSmall organic molecule
Emp. Form.C19H22N4O2
Mol. Mass.338.4036
SMILESC[C@H](C(=O)Nc1cc(n[nH]1)C1CC1)c1ccc(cc1)N1CCCC1=O