Reaction Details
TargetCyclin-dependent kinase 2
LigandBDBM7120
Substrate/Competitorn/a
Meas. Tech.ChEMBL_519498 (CHEMBL951804)
IC50 20±n/a nM
Citation Mascarenhas, NMGhoshal, N An efficient tool for identifying inhibitors based on 3D-QSAR and docking using feature-shape pharmacophore of biologically active conformation--a case study with CDK2/cyclinA. Eur J Med Chem43:2807-18 (2008) 
 
Cyclin-dependent kinase 2
Name:Cyclin-dependent kinase 2
Type:Enzyme Subunit
Mol. Mass.:33938.17
Organism:Homo sapiens (Human)
Description:P24941
Residue:298
BDBM7120
NameBDBM7120
Synonyms:(2S)-N-(5-Cyclopropyl-1H-pyrazol-3-yl)-2-[4-(2-oxo-1,3-oxazolidin-3-yl)phenyl]propanamide CHEMBL191834
TypeSmall organic molecule
Emp. Form.C18H20N4O3
Mol. Mass.340.3764
SMILESC[C@H](C(=O)Nc1cc(n[nH]1)C1CC1)c1ccc(cc1)N1CCOC1=O