Reaction Details
TargetCannabinoid receptor 1
LigandBDBM50242558
Substrate/Competitorn/a
Meas. Tech.ChEMBL_534562 (CHEMBL988123)
IC50 262±n/a nM
Citation Song, KSLee, SHChun, HJKim, JYJung, MEAhn, KKim, SUKim, JLee, J Design, synthesis and biological evaluation of piperazine analogues as CB1 cannabinoid receptor ligands. Bioorg Med Chem16:4035-51 (2008) 
 
Cannabinoid receptor 1
Name:Cannabinoid receptor 1
Type:G Protein-Coupled Receptor (GPCR)
Mol. Mass.:52856.55
Organism:Rattus norvegicus (rat)
Description:P20272
Residue:473
BDBM50242558
NameBDBM50242558
Synonyms:4-((4-Chlorophenyl)(2,4-dichlorophenyl)methyl)-N-(cyclohexylmethyl)piperazine-1-carboxamide | CHEMBL521068
TypeSmall organic molecule
Emp. Form.C25H30Cl3N3O
Mol. Mass.494.884
SMILESClc1ccc(cc1)C(N1CCN(CC1)C(=O)NCC1CCCCC1)c1ccc(Cl)cc1Cl