Reaction Details
TargetCannabinoid receptor 1
LigandBDBM50242582
Substrate/Competitorn/a
Meas. Tech.ChEMBL_534562 (CHEMBL988123)
IC50 104±n/a nM
Citation Song, KSLee, SHChun, HJKim, JYJung, MEAhn, KKim, SUKim, JLee, J Design, synthesis and biological evaluation of piperazine analogues as CB1 cannabinoid receptor ligands. Bioorg Med Chem16:4035-51 (2008) 
 
Cannabinoid receptor 1
Name:Cannabinoid receptor 1
Type:G Protein-Coupled Receptor (GPCR)
Mol. Mass.:52856.55
Organism:Rattus norvegicus (rat)
Description:P20272
Residue:473
BDBM50242582
NameBDBM50242582
Synonyms:4-((4-Chlorophenyl)(2,4-dichlorophenyl)methyl)-N-cyclohexylpiperazine-1-carboxamide CHEMBL529436
TypeSmall organic molecule
Emp. Form.C24H28Cl3N3O
Mol. Mass.480.858
SMILESClc1ccc(cc1)C(N1CCN(CC1)C(=O)NC1CCCCC1)c1ccc(Cl)cc1Cl