Reaction Details
TargetCannabinoid receptor 1
LigandBDBM50251132
Substrate/Competitorn/a
Meas. Tech.ChEMBL_534564 (CHEMBL988125)
IC50 146±n/a nM
Citation Song, KSLee, SHChun, HJKim, JYJung, MEAhn, KKim, SUKim, JLee, J Design, synthesis and biological evaluation of piperazine analogues as CB1 cannabinoid receptor ligands. Bioorg Med Chem16:4035-51 (2008) 
 
Cannabinoid receptor 1
Name:Cannabinoid receptor 1
Type:G Protein-Coupled Receptor (GPCR)
Mol. Mass.:52868.96
Organism:Homo sapiens (Human)
Description:P21554
Residue:472
BDBM50251132
NameBDBM50251132
Synonyms:4-((4-Bromophenyl)(2-chlorophenyl)methyl)-N-(cyclohexylmethyl)piperazine-1-carboxamide | CHEMBL463845
TypeSmall organic molecule
Emp. Form.C25H31BrClN3O
Mol. Mass.504.89
SMILESClc1ccccc1C(N1CCN(CC1)C(=O)NCC1CCCCC1)c1ccc(Br)cc1