Reaction Details
TargetCannabinoid receptor 1
LigandBDBM50242600
Substrate/Competitorn/a
Meas. Tech.ChEMBL_534564 (CHEMBL988125)
IC50 186±n/a nM
Citation Song, KSLee, SHChun, HJKim, JYJung, MEAhn, KKim, SUKim, JLee, J Design, synthesis and biological evaluation of piperazine analogues as CB1 cannabinoid receptor ligands. Bioorg Med Chem16:4035-51 (2008) 
 
Cannabinoid receptor 1
Name:Cannabinoid receptor 1
Type:G Protein-Coupled Receptor (GPCR)
Mol. Mass.:52868.96
Organism:Homo sapiens (Human)
Description:P21554
Residue:472
BDBM50242600
NameBDBM50242600
Synonyms:4-((4-Chlorophenyl)(2-(trifluoromethyl)phenyl)-methyl)-N-cyclohexylpiperazine-1-carboxamide | CHEMBL488614
TypeSmall organic molecule
Emp. Form.C25H29ClF3N3O
Mol. Mass.479.965
SMILESFC(F)(F)c1ccccc1C(N1CCN(CC1)C(=O)NC1CCCCC1)c1ccc(Cl)cc1