Reaction Details
TargetCannabinoid receptor 1
LigandBDBM50242599
Substrate/Competitorn/a
Meas. Tech.ChEMBL_534564 (CHEMBL988125)
IC50 334±n/a nM
Citation Song, KSLee, SHChun, HJKim, JYJung, MEAhn, KKim, SUKim, JLee, J Design, synthesis and biological evaluation of piperazine analogues as CB1 cannabinoid receptor ligands. Bioorg Med Chem16:4035-51 (2008) 
 
Cannabinoid receptor 1
Name:Cannabinoid receptor 1
Type:G Protein-Coupled Receptor (GPCR)
Mol. Mass.:52868.96
Organism:Homo sapiens (Human)
Description:P21554
Residue:472
BDBM50242599
NameBDBM50242599
Synonyms:CHEMBL528325 | N-tert-Butyl-4-((4-chlorophenyl)(o-tolyl)methyl)piperazine-1-carboxamide
TypeSmall organic molecule
Emp. Form.C23H30ClN3O
Mol. Mass.399.957
SMILESCc1ccccc1C(N1CCN(CC1)C(=O)NC(C)(C)C)c1ccc(Cl)cc1