Reaction Details
TargetCannabinoid receptor 1
LigandBDBM50242539
Substrate/Competitorn/a
Meas. Tech.ChEMBL_534564 (CHEMBL988125)
IC50 316±n/a nM
Citation Song, KSLee, SHChun, HJKim, JYJung, MEAhn, KKim, SUKim, JLee, J Design, synthesis and biological evaluation of piperazine analogues as CB1 cannabinoid receptor ligands. Bioorg Med Chem16:4035-51 (2008) 
 
Cannabinoid receptor 1
Name:Cannabinoid receptor 1
Type:G Protein-Coupled Receptor (GPCR)
Mol. Mass.:52868.96
Organism:Homo sapiens (Human)
Description:P21554
Residue:472
BDBM50242539
NameBDBM50242539
Synonyms:CHEMBL472299 | N-tert-Butyl-4-((4-chlorophenyl)(2,3-dichlorophenyl)-methyl)piperazine-1-carboxamide
TypeSmall organic molecule
Emp. Form.C22H26Cl3N3O
Mol. Mass.454.82
SMILESCC(C)(C)NC(=O)N1CCN(CC1)C(c1ccc(Cl)cc1)c1cccc(Cl)c1Cl