Reaction Details
TargetCannabinoid receptor 2
LigandBDBM50242566
Substrate/Competitorn/a
Meas. Tech.ChEMBL_534563 (CHEMBL988124)
IC50 4820±n/a nM
Citation Song, KSLee, SHChun, HJKim, JYJung, MEAhn, KKim, SUKim, JLee, J Design, synthesis and biological evaluation of piperazine analogues as CB1 cannabinoid receptor ligands. Bioorg Med Chem16:4035-51 (2008) 
 
Cannabinoid receptor 2
Name:Cannabinoid receptor 2
Type:G Protein-Coupled Receptor (GPCR)
Mol. Mass.:39690.94
Organism:Homo sapiens (Human)
Description:P34972
Residue:360
BDBM50242566
NameBDBM50242566
Synonyms:CHEMBL519584 | N-tert-Butyl-4-((2-chlorophenyl)(4-chlorophenyl)-methyl)piperazine-1-carboxamide
TypeSmall organic molecule
Emp. Form.C22H27Cl2N3O
Mol. Mass.420.375
SMILESCC(C)(C)NC(=O)N1CCN(CC1)C(c1ccc(Cl)cc1)c1ccccc1Cl