Reaction Details
TargetCannabinoid receptor 2
LigandBDBM50242537
Substrate/Competitorn/a
Meas. Tech.ChEMBL_534563 (CHEMBL988124)
IC50>10000±n/a nM
Citation Song, KSLee, SHChun, HJKim, JYJung, MEAhn, KKim, SUKim, JLee, J Design, synthesis and biological evaluation of piperazine analogues as CB1 cannabinoid receptor ligands. Bioorg Med Chem16:4035-51 (2008) 
 
Cannabinoid receptor 2
Name:Cannabinoid receptor 2
Type:G Protein-Coupled Receptor (GPCR)
Mol. Mass.:39690.94
Organism:Homo sapiens (Human)
Description:P34972
Residue:360
BDBM50242537
NameBDBM50242537
Synonyms:4-((4-Chlorophenyl)(2,3-dichlorophenyl)methyl)-N-cycloheptylpiperazine-1-carboxamide | CHEMBL472300
TypeSmall organic molecule
Emp. Form.C25H30Cl3N3O
Mol. Mass.494.884
SMILESClc1ccc(cc1)C(N1CCN(CC1)C(=O)NC1CCCCCC1)c1cccc(Cl)c1Cl