Reaction Details
TargetCannabinoid receptor 1
LigandBDBM50251131
Substrate/Competitorn/a
Meas. Tech.ChEMBL_534562 (CHEMBL988123)
IC50 82.3±n/a nM
Citation Song, KSLee, SHChun, HJKim, JYJung, MEAhn, KKim, SUKim, JLee, J Design, synthesis and biological evaluation of piperazine analogues as CB1 cannabinoid receptor ligands. Bioorg Med Chem16:4035-51 (2008) 
 
Cannabinoid receptor 1
Name:Cannabinoid receptor 1
Type:G Protein-Coupled Receptor (GPCR)
Mol. Mass.:52856.55
Organism:Rattus norvegicus (rat)
Description:P20272
Residue:473
BDBM50251131
NameBDBM50251131
Synonyms:4-((4-Bromophenyl)(2-chlorophenyl)methyl)-N-cycloheptylpiperazine-1-carboxamide | CHEMBL463847
TypeSmall organic molecule
Emp. Form.C25H31BrClN3O
Mol. Mass.504.89
SMILESClc1ccccc1C(N1CCN(CC1)C(=O)NC1CCCCCC1)c1ccc(Br)cc1