Reaction Details
TargetCannabinoid receptor 1
LigandBDBM50251116
Substrate/Competitorn/a
Meas. Tech.ChEMBL_534562 (CHEMBL988123)
IC50 2050±n/a nM
Citation Song, KSLee, SHChun, HJKim, JYJung, MEAhn, KKim, SUKim, JLee, J Design, synthesis and biological evaluation of piperazine analogues as CB1 cannabinoid receptor ligands. Bioorg Med Chem16:4035-51 (2008) 
 
Cannabinoid receptor 1
Name:Cannabinoid receptor 1
Type:G Protein-Coupled Receptor (GPCR)
Mol. Mass.:52856.55
Organism:Rattus norvegicus (rat)
Description:P20272
Residue:473
BDBM50251116
NameBDBM50251116
Synonyms:CHEMBL465868 | N-tert-Butyl-4-((4-chlorophenyl)(2-(trifluoromethyl)-phenyl)methyl)piperazine-1-carboxamide
TypeSmall organic molecule
Emp. Form.C23H27ClF3N3O
Mol. Mass.453.928
SMILESCC(C)(C)NC(=O)N1CCN(CC1)C(c1ccc(Cl)cc1)c1ccccc1C(F)(F)F