Reaction Details
TargetCannabinoid receptor 1
LigandBDBM50242601
Substrate/Competitorn/a
Meas. Tech.ChEMBL_534562 (CHEMBL988123)
IC50 141±n/a nM
Citation Song, KSLee, SHChun, HJKim, JYJung, MEAhn, KKim, SUKim, JLee, J Design, synthesis and biological evaluation of piperazine analogues as CB1 cannabinoid receptor ligands. Bioorg Med Chem16:4035-51 (2008) 
 
Cannabinoid receptor 1
Name:Cannabinoid receptor 1
Type:G Protein-Coupled Receptor (GPCR)
Mol. Mass.:52856.55
Organism:Rattus norvegicus (rat)
Description:P20272
Residue:473
BDBM50242601
NameBDBM50242601
Synonyms:4-((4-Chlorophenyl)(2-(trifluoromethyl)phenyl)-methyl)-N-cycloheptylpiperazine-1-carboxamide | CHEMBL488615
TypeSmall organic molecule
Emp. Form.C26H31ClF3N3O
Mol. Mass.493.992
SMILESFC(F)(F)c1ccccc1C(N1CCN(CC1)C(=O)NC1CCCCCC1)c1ccc(Cl)cc1