Reaction Details
TargetCannabinoid receptor 1
LigandBDBM50242583
Substrate/Competitorn/a
Meas. Tech.ChEMBL_534562 (CHEMBL988123)
IC50 1390±n/a nM
Citation Song, KSLee, SHChun, HJKim, JYJung, MEAhn, KKim, SUKim, JLee, J Design, synthesis and biological evaluation of piperazine analogues as CB1 cannabinoid receptor ligands. Bioorg Med Chem16:4035-51 (2008) 
 
Cannabinoid receptor 1
Name:Cannabinoid receptor 1
Type:G Protein-Coupled Receptor (GPCR)
Mol. Mass.:52856.55
Organism:Rattus norvegicus (rat)
Description:P20272
Residue:473
BDBM50242583
NameBDBM50242583
Synonyms:4-(Bis(4-chlorophenyl)methyl)piperazin-1-yl)-(cyclohexyl)methanone | CHEMBL488032
TypeSmall organic molecule
Emp. Form.C24H28Cl2N2O
Mol. Mass.431.398
SMILESClc1ccc(cc1)C(N1CCN(CC1)C(=O)C1CCCCC1)c1ccc(Cl)cc1