Reaction Details
TargetLactoylglutathione lyase
LigandBDBM50241121
Substrate/Competitorn/a
Meas. Tech.ChEMBL_529831 (CHEMBL967534)
IC50 23000±n/a nM
Citation Takasawa, RTakahashi, SSaeki, KSunaga, SYoshimori, ATanuma, S Structure-activity relationship of human GLO I inhibitory natural flavonoids and their growth inhibitory effects. Bioorg Med Chem16:3969-75 (2008) 
 
Lactoylglutathione lyase
Name:Lactoylglutathione lyase
Type:Enzyme
Mol. Mass.:20772.95
Organism:Homo sapiens (Human)
Description:Q04760
Residue:184
BDBM50241121
NameBDBM50241121
Synonyms:(S)-5-((R)-3-(4-bromobenzylthio)-1-(carboxymethylamino)-1-oxopropan-2-ylamino)-2-amino-5-oxopentanoic acid S-p-bromobenzyl glutatione | S-p-bromobenzylglutathione
TypeSmall organic molecule
Emp. Form.C17H22BrN3O6S
Mol. Mass.476.342
SMILESN[C@@H](CCC(=O)N[C@@H](CSCc1ccc(Br)cc1)C(=O)NCC(O)=O)C(O)=O