Reaction Details
TargetLactoylglutathione lyase
LigandBDBM15236
Substrate/Competitorn/a
Meas. Tech.ChEMBL_529831 (CHEMBL967534)
IC50 560±n/a nM
Citation Takasawa, RTakahashi, SSaeki, KSunaga, SYoshimori, ATanuma, S Structure-activity relationship of human GLO I inhibitory natural flavonoids and their growth inhibitory effects. Bioorg Med Chem16:3969-75 (2008) 
 
Lactoylglutathione lyase
Name:Lactoylglutathione lyase
Type:Enzyme
Mol. Mass.:20772.95
Organism:Homo sapiens (Human)
Description:Q04760
Residue:184
BDBM15236
NameBDBM15236
Synonyms:3,5,7-trihydroxy-2-(3,4,5-trihydroxyphenyl)-4H-chromen-4-one CHEMBL164 Myricetin Myricetin (Myr) | cid_5281672
TypeSmall organic molecule
Emp. Form.C15H10O8
Mol. Mass.318.2351
SMILESOc1cc(O)c2c(c1)oc(-c1cc(O)c(O)c(O)c1)c(O)c2=O