Reaction Details
TargetLactoylglutathione lyase
LigandBDBM7459
Substrate/Competitorn/a
Meas. Tech.ChEMBL_529831 (CHEMBL967534)
IC50 7700±n/a nM
Citation Takasawa, RTakahashi, SSaeki, KSunaga, SYoshimori, ATanuma, S Structure-activity relationship of human GLO I inhibitory natural flavonoids and their growth inhibitory effects. Bioorg Med Chem16:3969-75 (2008) 
 
Lactoylglutathione lyase
Name:Lactoylglutathione lyase
Type:Enzyme
Mol. Mass.:20772.95
Organism:Homo sapiens (Human)
Description:Q04760
Residue:184
BDBM7459
NameBDBM7459
Synonyms:2-(3,4-dihydroxyphenyl)-5,7-dihydroxy-4H-chromen-4-one CHEMBL151 Luteolin (4) cid_5280445 med.21724, Compound 3
TypeSmall organic molecule
Emp. Form.C15H10O6
Mol. Mass.286.2363
SMILESOc1cc(O)c2c(c1)oc(cc2=O)-c1ccc(O)c(O)c1