Reaction Details
TargetEpidermal growth factor receptor
LigandBDBM3032
Substrate/Competitorn/a
Meas. Tech.ChEMBL_542756 (CHEMBL1016812)
IC50 0.025±n/a nM
Citation Zhang, YChen, ZLou, YYu, Y 2,3-Disubstituted 8-arylamino-3H-imidazo[4,5-g]quinazolines: a novel class of antitumor agents. Eur J Med Chem44:448-52 (2008) 
 
Epidermal growth factor receptor
Name:Epidermal growth factor receptor
Type:Receptor Kinase Domain
Mol. Mass.:134279.59
Organism:Homo sapiens (Human)
Description:P00533
Residue:1210
BDBM3032
NameBDBM3032
Synonyms:CHEMBL1204168 N-(3-bromophenyl)-6,7-dimethoxyquinazolin-4-amine US11001595, Compound PD153035 US9422297, PD153035
TypeSmall organic molecule
Emp. Form.C16H14BrN3O2
Mol. Mass.360.205
SMILESCOc1cc2ncnc(Nc3cccc(Br)c3)c2cc1OC