Reaction Details
TargetD(2) dopamine receptor
LigandBDBM50016785
Substrate/Competitorn/a
Meas. Tech.ChEMBL_533449 (CHEMBL986941)
Ki 19.9±n/a nM
Citation Sipos, ACsutorás, CBerényi, SUustare, ARinken, A Synthesis and neuropharmacological characterization of 2-O-substituted apomorphines. Bioorg Med Chem16:4563-8 (2008) 
 
D(2) dopamine receptor
Name:D(2) dopamine receptor
Type:G Protein-Coupled Receptor (GPCR)
Mol. Mass.:50931.60
Organism:Rattus norvegicus (rat)
Description:P61169
Residue:444
BDBM50016785
NameBDBM50016785
Synonyms:(R)-2-Amino-6-methyl-5,6,6a,7-tetrahydro-4H-dibenzo[de,g]quinoline-10,11-diol CHEMBL276042
TypeSmall organic molecule
Emp. Form.C17H18N2O2
Mol. Mass.282.337
SMILESCN1CCc2cc(N)cc-3c2[C@H]1Cc1ccc(O)c(O)c-31