Reaction Details
TargetD(1A) dopamine receptor
LigandBDBM50251331
Substrate/Competitorn/a
Meas. Tech.ChEMBL_533454 (CHEMBL986946)
Ki>10000±n/a nM
Citation Sipos, ACsutorás, CBerényi, SUustare, ARinken, A Synthesis and neuropharmacological characterization of 2-O-substituted apomorphines. Bioorg Med Chem16:4563-8 (2008) 
 
D(1A) dopamine receptor
Name:D(1A) dopamine receptor
Type:Enzyme
Mol. Mass.:49613.93
Organism:Mus musculus (Mouse)
Description:Q61616
Residue:446
BDBM50251331
NameBDBM50251331
Synonyms:Bis-{[R-(-)-apomorphine-2-oxy]ethyl} ether | CHEMBL444149
TypeSmall organic molecule
Emp. Form.C38H40N2O7
Mol. Mass.636.7334
SMILESCN1CCc2cc(OCCOCCOc3cc4CCN(C)[C@@H]5Cc6ccc(O)c(O)c6-c(c3)c45)cc-3c2[C@H]1Cc1ccc(O)c(O)c-31