Reaction Details
TargetD(1A) dopamine receptor
LigandBDBM50251328
Substrate/Competitorn/a
Meas. Tech.ChEMBL_533454 (CHEMBL986946)
Ki 5300±n/a nM
Citation Sipos, ACsutorás, CBerényi, SUustare, ARinken, A Synthesis and neuropharmacological characterization of 2-O-substituted apomorphines. Bioorg Med Chem16:4563-8 (2008) 
 
D(1A) dopamine receptor
Name:D(1A) dopamine receptor
Type:Enzyme
Mol. Mass.:49613.93
Organism:Mus musculus (Mouse)
Description:Q61616
Residue:446
BDBM50251328
NameBDBM50251328
Synonyms:CHEMBL457275 | [R-(-)-Apomorphine-2-yl]-(2'-hydroxy-ethyl)ether
TypeSmall organic molecule
Emp. Form.C19H21NO4
Mol. Mass.327.3743
SMILESCN1CCc2cc(OCCO)cc-3c2[C@H]1Cc1ccc(O)c(O)c-31