Reaction Details
TargetCathepsin B
LigandBDBM50186088
Substrate/Competitorn/a
Meas. Tech.ChEMBL_518580 (CHEMBL959584)
Ki>10±n/a nM
Citation Li, JPetrassi, HMTumanut, CMasick, BTTrussell, CHarris, JL Substrate optimization for monitoring cathepsin C activity in live cells. Bioorg Med Chem17:1064-70 (2009) 
 
Cathepsin B
Name:Cathepsin B
Type:Enzyme
Mol. Mass.:37819.69
Organism:Homo sapiens (Human)
Description:gi_63102437
Residue:339
BDBM50186088
NameBDBM50186088
Synonyms:(S)-2-amino-N-((S)-2-(biphenyl-4-yl)-1-cyanoethyl)butanamide CHEMBL212521
TypeSmall organic molecule
Emp. Form.C19H21N3O
Mol. Mass.307.3895
SMILESCC[C@H](N)C(=O)N[C@@H](Cc1ccc(cc1)-c1ccccc1)C#N