Reaction Details
TargetTyrosine-protein kinase ABL1
LigandBDBM50247371
Substrate/Competitorn/a
Meas. Tech.ChEMBL_518628 (CHEMBL962773)
Ki 100±n/a nM
Citation Schenone, SBrullo, CBruno, OBondavalli, FMosti, LMaga, GCrespan, ECarraro, FManetti, FTintori, CBotta, M Synthesis, biological evaluation and docking studies of 4-amino substituted 1H-pyrazolo[3,4-d]pyrimidines. Eur J Med Chem43:2665-76 (2008) 
 
Tyrosine-protein kinase ABL1
Name:Tyrosine-protein kinase ABL1
Type:Enzyme
Mol. Mass.:122897.30
Organism:Homo sapiens (Human)
Description:P00519
Residue:1130
BDBM50247371
NameBDBM50247371
Synonyms:CHEMBL454923 | N-benzyl-1-(2-chloro-2-phenylethyl)-6-(propylthio)-1H-pyrazolo[3,4-d]pyrimidin-4-amine
TypeSmall organic molecule
Emp. Form.C23H24ClN5S
Mol. Mass.437.988
SMILESCCCSc1nc(NCc2ccccc2)c2cnn(CC(Cl)c3ccccc3)c2n1