Reaction Details
TargetCannabinoid receptor 1
LigandBDBM50247204
Substrate/Competitorn/a
Meas. Tech.ChEMBL_518637 (CHEMBL962782)
Ki 210±n/a nM
Citation Menozzi, GFossa, PCichero, ESpallarossa, ARanise, AMosti, L Rational design, synthesis and biological evaluation of new 1,5-diarylpyrazole derivatives as CB1 receptor antagonists, structurally related to rimonabant. Eur J Med Chem43:2627-38 (2008) 
 
Cannabinoid receptor 1
Name:Cannabinoid receptor 1
Type:G Protein-Coupled Receptor (GPCR)
Mol. Mass.:52868.96
Organism:Homo sapiens (Human)
Description:P21554
Residue:472
BDBM50247204
NameBDBM50247204
Synonyms:CHEMBL474125 | N-Cyclopropyl-1-(2,4-dichlorophenyl)-5-(4-iodophenyl)-1H-pyrazole-4-carboxamide
TypeSmall organic molecule
Emp. Form.C19H14Cl2IN3O
Mol. Mass.498.144
SMILESClc1ccc(c(Cl)c1)-n1ncc(C(=O)NC2CC2)c1-c1ccc(I)cc1