Reaction Details
TargetCannabinoid receptor 2
LigandBDBM21278
Substrate/Competitorn/a
Meas. Tech.ChEMBL_518639 (CHEMBL962784)
Ki 1580±n/a nM
Citation Menozzi, GFossa, PCichero, ESpallarossa, ARanise, AMosti, L Rational design, synthesis and biological evaluation of new 1,5-diarylpyrazole derivatives as CB1 receptor antagonists, structurally related to rimonabant. Eur J Med Chem43:2627-38 (2008) 
 
Cannabinoid receptor 2
Name:Cannabinoid receptor 2
Type:G Protein-Coupled Receptor (GPCR)
Mol. Mass.:39690.94
Organism:Homo sapiens (Human)
Description:P34972
Residue:360
BDBM21278
NameBDBM21278
Synonyms:5-(4-chlorophenyl)-1-(2,4-dichlorophenyl)-4-methyl-N-(piperidin-1-yl)-1H-pyrazole-3-carboxamide CHEMBL111 RIMONABANT HYDROCHLORIDE SR 141716A SR141716A [3H]SR141716A
TypeSmall organic molecule
Emp. Form.C22H21Cl3N4O
Mol. Mass.463.787
SMILESCc1c(nn(c1-c1ccc(Cl)cc1)-c1ccc(Cl)cc1Cl)C(=O)NN1CCCCC1