Reaction Details
TargetCytochrome c oxidase subunit 1
LigandBDBM13063
Substrate/Competitorn/a
Meas. Tech.ChEMBL_530100 (CHEMBL967598)
IC50 96200±n/a nM
Citation Erdélyi, PFodor, TVarga, AKCzugler, MGere, AFischer, J Chemical and biological investigation of N-hydroxy-valdecoxib: An active metabolite of valdecoxib. Bioorg Med Chem16:5322-30 (2008) 
 
Cytochrome c oxidase subunit 1
Name:Cytochrome c oxidase subunit 1
Type:PROTEIN
Mol. Mass.:57042.19
Organism:Ovis aries
Description:ChEMBL_662814
Residue:514
BDBM13063
NameBDBM13063
Synonyms:4-(5-methyl-3-phenyl-1,2-oxazol-4-yl)benzene-1-sulfonamide CHEMBL865 Valdecoxib | cid_119607
TypeSmall organic molecule
Emp. Form.C16H14N2O3S
Mol. Mass.314.359
SMILESCc1onc(c1-c1ccc(cc1)S(N)(=O)=O)-c1ccccc1